Status: fail
Result: fail
| Detail | Value |
|---|---|
| returncode | 0 |
| time | 0.561999797821 |
| environment | PIGLIT_TEST="LIT test 2 (degenerate case: 0 ^ 0 -> 1)" |
| command | Z:\piglit\framework/../bin/glean -r .\results\glean\fragProg1 -o -v -v -v -t +fragProg1 |
| info | Returncode: 0 Errors: Output: ---------------------------------------------------------------------- Fragment Program test 1: test a specific set of fragment programs. FAILURE: Program: LIT test 2 (degenerate case: 0 ^ 0 -> 1) Expected color: 1, 0.65, 1, 1 Observed color: 1, 0.65098, 0, 1 fragProg1: FAIL rgba8, z24, s8, win, id 3 0 tests passed, 1 tests failed. FAILURE: Program: LIT test 2 (degenerate case: 0 ^ 0 -> 1) Expected color: 1, 0.65, 1, 1 Observed color: 1, 0.65098, 0, 1 fragProg1: FAIL rgba8, db, z24, s8, accrgba16, win, id 4 0 tests passed, 1 tests failed. FAILURE: Program: LIT test 2 (degenerate case: 0 ^ 0 -> 1) Expected color: 1, 0.65, 1, 1 Observed color: 1, 0.65098, 0, 1 fragProg1: FAIL rgba8, z16, win, id 5 0 tests passed, 1 tests failed. FAILURE: Program: LIT test 2 (degenerate case: 0 ^ 0 -> 1) Expected color: 1, 0.65, 1, 1 Observed color: 1, 0.65098, 0, 1 fragProg1: FAIL rgba8, db, z16, accrgba16, win, id 6 0 tests passed, 1 tests failed. |